{"text_format":"1","workbook":"xlsx","n_sheets":15,"sheets":["Configuration","cover page","Form 1","Form 2A","Form 2B","Form 3","Form 4","Form 5","Form 6","Form 6a-incoming transfers","Form 6b-outgoing transfers","Form 7","Form 8","Form 9","Reference data"],"not_rendered":{"charts":0,"images":0,"macros":1,"external_links":0,"defined_names":0,"comments":0,"pivot_tables":0},"unopened":[],"bounds":{"document_bytes":16777216,"sheet_cells":100000,"rows_first":2000,"rows_last":500,"rows_between":2000,"halvings":0,"cell_chars":16384,"cell_head_chars":4096},"cells_cut":0,"cells_raw":0,"read":"whole","date_system":"1900"}

{"sheet":"Configuration","index":0,"n_rows":7,"n_cols":2,"rows_kept":7,"cut":false,"hidden":true,"merged":[]}
["LoaderName","Finance_Sector_Money_Transfer_meta"]
["MADLMetaFile"]
["Frequency","Weekly"]
["InstitutionForm","Quarterly MTCR"]
["validation","0"]
["timestamp","2020-07-16T12:58:23"]
[null,"Monthly"]

{"sheet":"cover page","index":1,"n_rows":13,"n_cols":27,"rows_kept":13,"cut":false,"hidden":false,"merged":[]}
["MTCR REPORT",null,null,null,null,null,null,null,null,null,null,null,null,null,null,null,null,null,null,null,null,null,null,null,null,null,2]
[" MONEY TRANSFER COMPANIES"]
[]
[]
[]
[]
[]
[]
["Institution:"]
[]
["Period  (Date Format  -> MM-YYYY )"]
[]
["Institute Xcode (Reporter Code)"]

{"sheet":"Form 1","index":2,"n_rows":30,"n_cols":4,"rows_kept":30,"cut":false,"hidden":false,"merged":[[5,0,5,1],[5,2,5,3],[6,2,6,3]]}
["Only for use by the",null,null,"Form: 1"]
["Centrale Bank van Aruba (CBA)",null,null,{"$f":"IF('cover page'!B11=\"\",\"Please fill in period in Cover Page\",\"Period: \"&'cover page'!B11)","v":"Please fill in period in Cover Page"}]
[null,null,null,"(Rounded to nearest hundred)"]
["CASH FLOW STATEMENT"]
[]
["Description",null,"Amounts"]
[null,null,"in Afl."]
[null,"Liquidity Position At The Beginning Of The Month"]
[]
[null,"Total Amount Received From Clients In Connection With Outgoing Money Transfers"]
[null,"Reimbursements"]
[null,"Foreign Exchange Tax Received From Clients"]
[null,"Commission Received"]
[null,"Other Fees (Service Fees, Such As Fax Charges, Door To Door Delivery Charges Etc.)"]
[null,"Exchange Rate Differences"]
[null,"Other Receipts"]
[null,"Total Receipts",null,{"$f":"SUM(C10:C16)","v":0}]
[null,""]
[null,"Total Amount Paid To Customers In Connection With Incoming Money Transfers"]
[null,"Foreign Exchange Tax Paid To The Cba"]
[null,"Payments Made To Correspondents"]
[null,"Payment Of Direct Expenses Icw Sales Money Transfers (Form 8)"]
[null,"Payment Of Direct Expenses Icw Other Related Activities (Form 8)"]
[null,"Operating Expenses"]
[null,"Exchange Rate Differences"]
[null,"Other Payments"]
[null,"Total Payments",null,{"$f":"SUM(C19:C26)","v":0}]
[null,""]
[null,""]
[null,"Liquidity Position At The End Of The Month",null,{"$f":"D8+D17-D27","v":0}]

{"sheet":"Form 2A","index":3,"n_rows":501,"n_cols":9,"rows_kept":501,"cut":false,"hidden":false,"merged":[]}
["Only for use by the",null,null,null,null,null,null,null,"Form: 2A"]
["Centrale Bank van Aruba (CBA)",null,null,null,null,null,null,null,{"$f":"IF( 'cover page'!B11=\"\", \"Please fill in period in Cover Page\",\"Period: \"& 'cover page'!B11)","v":"Please fill in period in Cover Page"}]
[null,null,null,null,null,null,null,null,"(Rounded to nearest Afl.)"]
["NUMBER OF TRANSACTIONS DIVIDED INTO TRANSACTION SIZE (OUTGOING)"]
[]
["Country of destination","#","Transactions Afl.","#","Transactions Afl.","#","Transactions Afl.","#","Transactions Afl."]
[null,null,"0 - 2,500",null,"2,501 - 5,000",null,"5,001 - 7,500 ",null,"7,501 - 10,000"]
[]
[]
[]
[]
[]
[]
[]
[]
[]
[]
[]
[]
[]
[]
[]
[]
[]
[]
[]
[]
[]
[]
[]
[]
[]
[]
[]
[]
[]
[]
[]
[]
[]
[]
[]
[]
[]
[]
[]
[]
[]
[]
[]
[]
[]
[]
[]
[]
[]
[]
[]
[]
[]
[]
[]
[]
[]
[]
[]
[]
[]
[]
[]
[]
[]
[]
[]
[]
[]
[]
[]
[]
[]
[]
[]
[]
[]
[]
[]
[]
[]
[]
[]
[]
[]
[]
[]
[]
[]
[]
[]
[]
[]
[]
[]
[]
[]
[]
[]
[]
[]
[]
[]
[]
[]
[]
[]
[]
[]
[]
[]
[]
[]
[]
[]
[]
[]
[]
[]
[]
[]
[]
[]
[]
[]
[]
[]
[]
[]
[]
[]
[]
[]
[]
[]
[]
[]
[]
[]
[]
[]
[]
[]
[]
[]
[]
[]
[]
[]
[]
[]
[]
[]
[]
[]
[]
[]
[]
[]
[]
[]
[]
[]
[]
[]
[]
[]
[]
[]
[]
[]
[]
[]
[]
[]
[]
[]
[]
[]
[]
[]
[]
[]
[]
[]
[]
[]
[]
[]
[]
[]
[]
[]
{"$rows_left_out":302}
{"sheet":"Form 2B","index":4,"n_rows":501,"n_cols":9,"rows_kept":501,"cut":false,"hidden":false,"merged":[]}
["Only for use by the",null,null,null,null,null,null,null,"Form: 2B"]
["Centrale Bank van Aruba (CBA)",null,null,null,null,null,null,null,{"$f":"IF( 'cover page'!B11=\"\", \"Please fill in period in Cover Page\",\"Period: \"& 'cover page'!B11)","v":"Please fill in period in Cover Page"}]
[null,null,null,null,null,null,null,null,"(Rounded to nearest Afl.)"]
["NUMBER OF TRANSACTIONS DIVIDED INTO TRANSACTION SIZE (INCOMING)"]
[]
["Country of origin","#","Transactions Afl.","#","Transactions Afl.","#","Transactions Afl.","#","Transactions Afl."]
[null,null,"0 - 2,500",null,"2,501 - 5,000",null,"5,001 - 7,500 ",null,"7,501 - 10,000"]
[]
[]
[]
[]
[]
[]
[]
[]
[]
[]
[]
[]
[]
[]
[]
[]
[]
[]
[]
[]
[]
[]
[]
[]
[]
[]
[]
[]
[]
[]
[]
[]
[]
[]
[]
[]
[]
[]
[]
[]
[]
[]
[]
[]
[]
[]
[]
[]
[]
[]
[]
[]
[]
[]
[]
[]
[]
[]
[]
[]
[]
[]
[]
[]
[]
[]
[]
[]
[]
[]
[]
[]
[]
[]
[]
[]
[]
[]
[]
[]
[]
[]
[]
[]
[]
[]
[]
[]
[]
[]
[]
[]
[]
[]
[]
[]
[]
[]
[]
[]
[]
[]
[]
[]
[]
[]
[]
[]
[]
[]
[]
[]
[]
[]
[]
[]
[]
[]
[]
[]
[]
[]
[]
[]
[]
[]
[]
[]
[]
[]
[]
[]
[]
[]
[]
[]
[]
[]
[]
[]
[]
[]
[]
[]
[]
[]
[]
[]
[]
[]
[]
[]
[]
[]
[]
[]
[]
[]
[]
[]
[]
[]
[]
[]
[]
[]
[]
[]
[]
[]
[]
[]
[]
[]
[]
[]
[]
[]
[]
[]
[]
[]
[]
[]
[]
[]
[]
[]
[]
[]
[]
[]
[]
{"$rows_left_out":302}
{"sheet":"Form 3","index":5,"n_rows":8,"n_cols":3,"rows_kept":8,"cut":false,"hidden":false,"merged":[]}
["Only for use by the",null,"Form: 3"]
["Centrale Bank van Aruba (CBA)"]
["NUMBER OF UNUSUAL TRANSACTIONS REPORTED TO MOT"]
[]
[null,null,{"$f":"IF( 'cover page'!B11=\"\", \"Please fill in period in Cover Page\",\"Period: \"& 'cover page'!B11)","v":"Please fill in period in Cover Page"}]
[null,"Number Of Transactions Reported Based Upon Objective Indicators"]
[null,"Number Of Transactions Reported Based Upon Subjective Indicators"]
[null,"Total Number Of Transactions Reported To MOT",{"$f":"SUM(C6:C7)","v":0}]

{"sheet":"Form 4","index":6,"n_rows":28,"n_cols":14,"rows_kept":28,"cut":false,"hidden":false,"merged":[[6,3,6,7],[6,8,6,12]]}
["Only for use by the",null,null,null,null,null,null,null,null,null,null,null,null,"Form: 4"]
["Centrale Bank van Aruba (CBA)",null,null,null,null,null,null,null,null,null,null,null,{"$f":"IF( 'cover page'!B11=\"\", \"Please fill in period in Cover Page\",\"Period: \"& 'cover page'!B11)","v":"Please fill in period in Cover Page"}]
[null,null,null,null,null,null,null,null,null,null,null,null,"(Rounded to nearest hundred)"]
[]
["MOVEMENTS IN BANK ACCOUNT in Afl."]
[]
[null,null,null,"Receipts",null,null,null,null,"Payments",null,null,null,null,"Closing Balance"]
[null,"Bank Account Number:","Currency","Opening Balance In Afl.","Deposits","Transfers From Other Accounts","Other Receipts","Total Receipts","Payments Made To Correspondents","Transfers To Other Bank Accounts","Payment Foreign Exchange Tax","Other Payments","Total Payments","Closing Balance"]
[null,null,null,null,null,null,null,{"$f":"SUM(E9:G9)","v":0},null,null,null,null,{"$f":"SUM(I9:L9)","v":0},{"$f":"(D9+H9)-M9","v":0}]
[null,null,null,null,null,null,null,{"$f":"SUM(E10:G10)","v":0},null,null,null,null,{"$f":"SUM(I10:L10)","v":0},{"$f":"(D10+H10)-M10","v":0}]
[null,null,null,null,null,null,null,0,null,null,null,null,0,0]
[null,null,null,null,null,null,null,0,null,null,null,null,0,0]
[null,null,null,null,null,null,null,0,null,null,null,null,0,0]
[null,null,null,null,null,null,null,0,null,null,null,null,0,0]
[null,null,null,null,null,null,null,0,null,null,null,null,0,0]
[null,null,null,null,null,null,null,0,null,null,null,null,0,0]
[null,null,null,null,null,null,null,0,null,null,null,null,0,0]
[null,null,null,null,null,null,null,0,null,null,null,null,0,0]
[null,null,null,null,null,null,null,0,null,null,null,null,0,0]
[null,null,null,null,null,null,null,0,null,null,null,null,0,0]
[null,null,null,null,null,null,null,0,null,null,null,null,0,0]
[null,null,null,null,null,null,null,0,null,null,null,null,0,0]
[null,null,null,null,null,null,null,0,null,null,null,null,0,0]
[null,null,null,null,null,null,null,0,null,null,null,null,0,0]
[null,null,null,null,null,null,null,0,null,null,null,null,0,0]
[null,null,null,null,null,null,null,0,null,null,null,null,0,0]
[null,null,null,null,null,null,null,0,null,null,null,null,0,0]
[null,null,null,null,null,null,null,0,null,null,null,null,0,0]

{"sheet":"Form 5","index":7,"n_rows":17,"n_cols":7,"rows_kept":17,"cut":false,"hidden":false,"merged":[[16,0,16,1],[7,0,7,1]]}
["Only for use by the",null,null,null,null,null,"Form: 5"]
["Centrale Bank van Aruba (CBA)",null,null,null,null,null,{"$f":"IF( 'cover page'!B11=\"\", \"Please fill in period in Cover Page\",\"Period: \"& 'cover page'!B11)","v":"Please fill in period in Cover Page"}]
[null,null,null,null,null,null,"(Rounded to nearest hundred)"]
[]
[]
["AMOUNTS RECEIVED FROM CUSTOMERS IN CONNECTION WITH MONEY TRANSFERS SPECIFIED PER CURRENCY"]
[]
["Transfers amount",null,"Amounts","Amounts","Amounts","Amounts","Total amounts"]
[null,null,"in Afl.","in USD","in Euro","in other foreign currencies","received in Afl."]
[]
[null,"Total Net Amount Received From Customers"]
[null,""]
[null,"Foreign Exchange Tax"]
[null,"Commission"]
[null,"Other Fees (Fax, Door To Door And Message Charges)"]
[]
["Total Amount Received From Customers",null,{"$f":"SUM(C10:C16)","v":0},{"$f":"SUM(D10:D16)","v":0},0,0,{"$f":"SUM(C17:F17)","v":0}]

{"sheet":"Form 6","index":8,"n_rows":27,"n_cols":11,"rows_kept":27,"cut":false,"hidden":false,"merged":[[5,3,5,6],[5,7,5,9]]}
["Only for use by the",null,null,null,null,null,null,null,null,"Form: 6"]
["Centrale Bank van Aruba (CBA)",null,null,null,null,null,null,null,null,{"$f":"IF( 'cover page'!B11=\"\", \"Please fill in period in Cover Page\",\"Period: \"& 'cover page'!B11)","v":"Please fill in period in Cover Page"}]
[null,null,null,null,null,null,null,null,null,"(Rounded to nearest hundred)"]
["CURRENT ACCOUNT WITH CORRESPONDENTS in Afl."]
[]
[null,null,null,"Incoming transfers",null,null,null,"Outgoing transfers",null,null,"Closing Balance"]
[null,"Correspondent Name:","Correspondent Country:","Opening Balance","Payments Made To Resident Customers On Behalf Of Correspondents (negative values only)","Payments Received From Correspondent For Settlements","Total Incoming Transfer","Payments Made By Correspondents To Beneficiaries Abroad","Payments Made To Settle Account With Correspondents (negative values only)","Total Outgoing Transfers","Closing Balance"]
[null,null,null,null,null,null,{"$f":"SUM(E8:F8)","v":0},null,null,{"$f":"SUM(H8:I8)","v":0},{"$f":"(D8+G8)+J8","v":0}]
[null,null,null,null,null,null,{"$f":"SUM(E9:F9)","v":0},null,null,{"$f":"SUM(H9:I9)","v":0},{"$f":"(D9+G9)+J9","v":0}]
[null,null,null,null,null,null,0,null,null,0,0]
[null,null,null,null,null,null,0,null,null,0,0]
[null,null,null,null,null,null,0,null,null,0,0]
[null,null,null,null,null,null,0,null,null,0,0]
[null,null,null,null,null,null,0,null,null,0,0]
[null,null,null,null,null,null,0,null,null,0,0]
[null,null,null,null,null,null,0,null,null,0,0]
[null,null,null,null,null,null,0,null,null,0,0]
[null,null,null,null,null,null,0,null,null,0,0]
[null,null,null,null,null,null,0,null,null,0,0]
[null,null,null,null,null,null,0,null,null,0,0]
[null,null,null,null,null,null,0,null,null,0,0]
[null,null,null,null,null,null,0,null,null,0,0]
[null,null,null,null,null,null,0,null,null,0,0]
[null,null,null,null,null,null,0,null,null,0,0]
[null,null,null,null,null,null,0,null,null,0,0]
[null,null,null,null,null,null,0,null,null,0,0]
[null,null,null,null,null,null,0,null,null,0,0]

{"sheet":"Form 6a-incoming transfers","index":9,"n_rows":1,"n_cols":8,"rows_kept":1,"cut":false,"hidden":false,"merged":[]}
["Period\n(yyyy-MM-dd)","Transaction Code","Receiver  Name","Receiver \nResident/\nNon-Resident","Sender Name","Sender Country Code","Transaction Amount","Transaction\nDescription"]

{"sheet":"Form 6b-outgoing transfers","index":10,"n_rows":1,"n_cols":8,"rows_kept":1,"cut":false,"hidden":false,"merged":[]}
["Period\n(yyyy-MM-dd)","Transaction Code","Sender Name","Sender\n Resident/\nNon-Resident","Receiver Name","Receiver Country Code","Transaction Amount","Transaction Description"]

{"sheet":"Form 7","index":11,"n_rows":27,"n_cols":8,"rows_kept":27,"cut":false,"hidden":false,"merged":[]}
["Only for use by the",null,null,null,null,null,"Form: 7"]
["Centrale Bank van Aruba (CBA)",null,null,null,null,null,{"$f":"IF( 'cover page'!B11=\"\", \"Please fill in period in Cover Page\",\"Period: \"& 'cover page'!B11)","v":"Please fill in period in Cover Page"}]
[null,null,null,null,null,null,"(Rounded to nearest hundred)"]
[]
["OUTSTANDING TRANSFER AMOUNT NOT YET PAID BY CORRESPONDENTS in Afl."]
[]
[null,"Correspondent name:","Opening Balance","Amounts received from customers to be paid to beneficiaries by correspondents","Payments made by correspondents to beneficiaries abroad","Closing Balance","Bank guarantee","Surplus/Deficit"]
[null,null,null,null,null,{"$f":"C8+D8-E8","v":0},null,{"$f":"G8-F8","v":0}]
[null,null,null,null,null,{"$f":"C9+D9-E9","v":0},null,{"$f":"G9-F9","v":0}]
[null,null,null,null,null,0,null,0]
[null,null,null,null,null,0,null,0]
[null,null,null,null,null,0,null,0]
[null,null,null,null,null,0,null,0]
[null,null,null,null,null,0,null,0]
[null,null,null,null,null,0,null,0]
[null,null,null,null,null,0,null,0]
[null,null,null,null,null,0,null,0]
[null,null,null,null,null,0,null,0]
[null,null,null,null,null,0,null,0]
[null,null,null,null,null,0,null,0]
[null,null,null,null,null,0,null,0]
[null,null,null,null,null,0,null,0]
[null,null,null,null,null,0,null,0]
[null,null,null,null,null,0,null,0]
[null,null,null,null,null,0,null,0]
[null,null,null,null,null,0,null,0]
[null,null,null,null,null,0,null,0]

{"sheet":"Form 8","index":12,"n_rows":34,"n_cols":3,"rows_kept":34,"cut":false,"hidden":false,"merged":[]}
["Only for use by the",null,"Form: 8"]
["Centrale Bank van Aruba (CBA)",null,"(Rounded to nearest hundred)"]
[]
["INCOME STATEMENT"]
[]
[null,null,{"$f":"IF( 'cover page'!B11=\"\", \"Please fill in period in Cover Page\",\"Period: \"& 'cover page'!B11)","v":"Please fill in period in Cover Page"}]
[null,"REVENUES"]
[null,"Sales Money Transfers"]
[null,"Direct Expenses Icw Sales Money Transfers"]
[null,"Gross Margin Money Transfers",{"$f":"C8-C9","v":0}]
[null,""]
[null,"Sales Other Related Activities"]
[null,"Direct Expenses Icw Other Related Activities"]
[null,"Gross Margin Other Activities",{"$f":"C12-C13","v":0}]
[null,""]
[null,"Total Gross Margin",{"$f":"C10+C14","v":0}]
[]
[null,"OPERATING EXPENSES"]
[null,"Personnel Expenses"]
[null,"Marketing And Selling"]
[null,"Accomodation Expenses"]
[null,"General Expenses"]
[null,"Charges From Affiliates"]
[null,"Depreciation And Amortization"]
[null,"Total Operating Expenses",{"$f":"SUM(C19:C24)","v":0}]
[null,""]
[null,"Result From Operations",{"$f":"C16-C25","v":0}]
[null,""]
[null,"Interest Income/Expenses"]
[null,"Other Gains/Losses"]
[null,""]
[null,"Result Before Taxation",{"$f":"C27+C29+C30","v":0}]
[null,"Profit Tax"]
[null,"Result After Taxation",{"$f":"C32-C33","v":0}]

{"sheet":"Form 9","index":13,"n_rows":38,"n_cols":3,"rows_kept":38,"cut":false,"hidden":false,"merged":[]}
["Only for use by the",null,"Form: 9"]
["Centrale Bank van Aruba (CBA)",null,"(Rounded to nearest hundred)"]
[]
["BALANCE SHEET"]
[null,null,{"$f":"IF( 'cover page'!B11=\"\", \"Please fill in period in Cover Page\",\"Period: \"& 'cover page'!B11)","v":"Please fill in period in Cover Page"}]
[null,"Fixed Assets"]
[null,"Building"]
[null,"Furniture. Fixture & Equipment"]
[null,"Vehicles"]
[null,"Goodwill"]
[null,"Total Fixed Assets",{"$f":"SUM(C7:C10)","v":0}]
[null,"Current Assets"]
[null,"Time Deposits"]
[null,"Receivables"]
[null,"Inventories"]
[null,"Total Current Assets",{"$f":"SUM(C12:C15)","v":0}]
[null,"Liquid Assets"]
[null,"Cash"]
[null,"Bank"]
[null,"Total Liquid Assets",{"$f":"SUM(C17:C19)","v":0}]
[null,"Total Assets",{"$f":"C11+C16+C20","v":0}]
[null,""]
[null,"Equity"]
[null,"Paid In Share Capital"]
[null,"Retained Earnings"]
[null,"Result Current Year"]
[null,"Total Equity",{"$f":"SUM(C24:C26)","v":0}]
[null,"Long-Term Liabilities"]
[null,"Provisions"]
[null,"Due To Group Companies"]
[null,"Other Long-Term Liabilities"]
[null,"Total Long-Term Liabilities",{"$f":"SUM(C29:C31)","v":0}]
[null,"Short-Term Liabilities"]
[null,"Payables"]
[null,"Current Account Shareholders"]
[null,"Other Short-Term Liabilities"]
[null,"Total Short-Term Liabilities",{"$f":"SUM(C34:C36)","v":0}]
[null,"Total Shareholders' Equity And Liabilities",{"$f":"C27+C32+C37","v":0}]

{"sheet":"Reference data","index":14,"n_rows":256,"n_cols":10,"rows_kept":256,"cut":false,"hidden":false,"merged":[]}
["MTC companies",null,"Country Code","Country Name","Periods","Search Country Code:","Months","Transactioncode (Full description)","Transaction Code","Period"]
["Mack's Exchange Services V.B.A.",null,"AF","Afghanistan, Islamic State of","Q1-2014","aw","2016-01-01","Goods-Consumer goods ",1010,"Weekly"]
["Post Aruba N.V.",null,"AL","Albania","Q2-2014",{"$f":"VLOOKUP(F2,C2:D256, 2,FALSE)","v":"Aruba"},"2016-02-01","Goods-Investment goods ",1020,"Monthly"]
["Union Caribe N.V.",null,"DZ","Algeria","Q3-2014",null,"2016-03-01","Goods-Nonmonetary gold ",1060]
[null,null,"AS","American Samoa","Q4-2014","Search Country Name:","2016-04-01","Services-Maintenance and repair services n.i.e. ",1404]
[null,null,"AD","Andorra","Q1-2015","aruba","2016-05-01","Services-Air transport-Passenger ",1121]
[null,null,"AO","Angola","Q2-2015",{"$f":"INDEX(C2:D256,MATCH(F6,D2:D256,0),1)","v":"AW"},"2016-06-01","Services-Air transport-Freight ",1122]
[null,null,"AI","Anguilla","Q3-2015",null,"2016-07-01","Services-Air transport-Other  ",1123]
[null,null,"AQ","Antarctica","Q4-2015",null,"2016-08-01","Servcies-Other modes of transport ",1134]
[null,null,"AG","Antigua and Barbuda","Q1-2016",null,"2016-09-01","Services-Postal and courier services ",1135]
[null,null,"AR","Argentina","Q2-2016",null,"2016-10-01","Services-Tourism-Travel cheques, wire transfers etc. ",1211]
[null,null,"AM","Armenia","Q3-2016",null,"2016-11-01","Services-Tourism-Time-share with membership system ",1216]
[null,null,"AW","Aruba","Q4-2016",null,"2016-12-01","Servcies-Tourism-Other-Health-related  ",1240]
[null,null,"AU","Australia","Q1-2017",null,"2017-01-01","Services-Tourism-Other-Education-related ",1250]
[null,null,"AT","Austria","Q2-2017",null,"2017-02-01","Services-Construction in Aruba ",1420]
[null,null,"AZ","Azerbaijan","Q3-2017",null,"2017-03-01","Services-Construction services abroad  ",1421]
[null,null,"BS","Bahamas, The","Q4-2017",null,"2017-04-01","Services-Insurance and pension services ",1470]
[null,null,"BH","Bahrain ","Q1-2018",null,"2017-05-01","Services-Financial services ",1440]
[null,null,"BD","Bangladesh","Q2-2018",null,"2017-06-01","Services-Charges for the use of intellectual property n.i.e. ",1481]
[null,null,"BB","Barbados","Q3-2018",null,"2017-07-01","Services-Telecommunications, computer, and information services ",1410]
[null,null,"BY","Belarus","Q4-2018",null,"2017-08-01","Services-Other business services ",1460]
[null,null,"BE","Belgium","Q1-2019",null,"2017-09-01","Services-Personal, cultural, and recreational services ",1495]
[null,null,"BZ","Belize","Q2-2019",null,"2017-10-01","Income - Compensation of employees ",1510]
[null,null,"BJ","Benin","Q3-2019",null,"2017-11-01","Other sectors-Personal Transfers Workers' Remittances ",1710]
[null,null,"BM","Bermuda","Q4-2019",null,"2017-12-01","Other sectors-Personal transfers Other personal transfers ",1720]
[null,null,"BT","Bhutan","Q1-2020",null,"2018-01-01","Other sectors-Social contributions and social benefits  ",1750]
[null,null,"BO","Bolivia","Q2-2020",null,"2018-02-01","Other sectors-Non-life insurance and reinsurance premiums and claims  ",1730]
[null,null,"BQ","Bonaire (BES islands)","Q3-2020",null,"2018-03-01","Other sectors-Other sector current transfers  ",1760]
[null,null,"BA","Bosnia and Herzegovina ","Q4-2020",null,"2018-04-01"]
[null,null,"BW","Botswana","Q1-2021",null,"2018-05-01"]
[null,null,"BV","Bouvet Island","Q2-2021",null,"2018-06-01"]
[null,null,"BR","Brazil","Q3-2021",null,"2018-07-01"]
[null,null,"IO","British Indian Ocean Territory","Q4-2021",null,"2018-08-01"]
[null,null,"BN","Brunei Darussalam","Q1-2022",null,"2018-09-01"]
[null,null,"BG","Bulgaria","Q2-2022",null,"2018-10-01"]
[null,null,"BF","Burkina Faso","Q3-2022",null,"2018-11-01"]
[null,null,"BI","Burundi","Q4-2022",null,"2018-12-01"]
[null,null,"KH","Cambodia","Q1-2023"]
[null,null,"CM","Cameroon","Q2-2023"]
[null,null,"CA","Canada","Q3-2023"]
[null,null,"CV","Cape Verde","Q4-2023"]
[null,null,"KY","Cayman Islands","Q1-2024"]
[null,null,"CF","Central African Republic","Q2-2024"]
[null,null,"TD","Chad","Q3-2024"]
[null,null,"CL","Chile","Q4-2024"]
[null,null,"CN","China, P.R.","Q1-2025"]
[null,null,"CX","Christmas Island","Q2-2025"]
[null,null,"CC","Cocos (Keeling) Islands","Q3-2025"]
[null,null,"CO","Colombia","Q4-2025"]
[null,null,"KM","Comoros","Q1-2026"]
[null,null,"CD","Congo, Dem. Rep. of","Q2-2026"]
[null,null,"CG","Congo, Rep. of","Q3-2026"]
[null,null,"CK","Cook Islands","Q4-2026"]
[null,null,"CR","Costa Rica","Q1-2027"]
[null,null,"CI","Côte d'Ivoire","Q2-2027"]
[null,null,"HR","Croatia","Q3-2027"]
[null,null,"CU","Cuba","Q4-2027"]
[null,null,"CW","Curaçao ","Q1-2028"]
[null,null,"CY","Cyprus","Q2-2028"]
[null,null,"CZ","Czech Republic","Q3-2028"]
[null,null,"DK","Denmark","Q4-2028"]
[null,null,"DJ","Djibouti"]
[null,null,"DM","Dominica"]
[null,null,"DO","Dominican Republic"]
[null,null,"EC","Ecuador"]
[null,null,"EG","Egypt"]
[null,null,"SV","El Salvador"]
[null,null,"GQ","Equatorial Guinea"]
[null,null,"ER","Eritrea"]
[null,null,"EE","Estonia"]
[null,null,"ET","Ethiopia"]
[null,null,"FK","Falkland Islands (Malvinas) "]
[null,null,"FO","Faroe Islands"]
[null,null,"FJ","Fiji"]
[null,null,"FI","Finland"]
[null,null,"FR","France"]
[null,null,"GF","French Guiana"]
[null,null,"PF","French Polynesia"]
[null,null,"TF","French Southern Territories"]
[null,null,"GA","Gabon"]
[null,null,"GM","Gambia, The"]
[null,null,"GE","Georgia"]
[null,null,"DE","Germany"]
[null,null,"GH","Ghana"]
[null,null,"GI","Gibraltar"]
[null,null,"GR","Greece"]
[null,null,"GL","Greenland"]
[null,null,"GD","Grenada"]
[null,null,"GP","Guadeloupe"]
[null,null,"GU","Guam"]
[null,null,"GT","Guatemala"]
[null,null,"GG","Guernsey"]
[null,null,"GN","Guinea"]
[null,null,"GW","Guinea-Bissau"]
[null,null,"GY","Guyana"]
[null,null,"HT","Haiti"]
[null,null,"HM","Heard Island and McDonald Mcdonald Islands"]
[null,null,"HN","Honduras"]
[null,null,"HK","Hong Kong SAR of China"]
[null,null,"HU","Hungary"]
[null,null,"IS","Iceland"]
[null,null,"IN","India"]
[null,null,"ID","Indonesia"]
[null,null,"IR","Iran, Islamic Republic of"]
[null,null,"IQ","Iraq"]
[null,null,"IE","Ireland"]
[null,null,"IM","Isle of Man"]
[null,null,"IL","Israel"]
[null,null,"IT","Italy"]
[null,null,"JM","Jamaica"]
[null,null,"JP","Japan"]
[null,null,"JE","Jersey"]
[null,null,"JO","Jordan"]
[null,null,"KZ","Kazakhstan"]
[null,null,"KE","Kenya"]
[null,null,"KI","Kiribati"]
[null,null,"KP","Korea, Democratic People's Republic of (North Korea)"]
[null,null,"KR","Korea, Republic of (South Korea)"]
[null,null,"XK","Kosovo"]
[null,null,"KW","Kuwait"]
[null,null,"KG","Kyrgyz Republic"]
[null,null,"LA","Lao People's Democratic Republic"]
[null,null,"LV","Latvia"]
[null,null,"LB","Lebanon"]
[null,null,"LS","Lesotho"]
[null,null,"LR","Liberia"]
[null,null,"LY","Libya"]
[null,null,"LI","Liechtenstein"]
[null,null,"LT","Lithuania"]
[null,null,"LU","Luxembourg"]
[null,null,"MO","Macao SAR of China"]
[null,null,"MK","Macedonia, FYR"]
[null,null,"MG","Madagascar"]
[null,null,"MW","Malawi"]
[null,null,"MY","Malaysia"]
[null,null,"MV","Maldives"]
[null,null,"ML","Mali"]
[null,null,"MT","Malta"]
[null,null,"MH","Marshall Islands"]
[null,null,"MQ","Martinique"]
[null,null,"MR","Mauritania"]
[null,null,"MU","Mauritius"]
[null,null,"YT","Mayotte"]
[null,null,"MX","Mexico"]
[null,null,"FM","Micronesia, Federated States of"]
[null,null,"MD","Moldova"]
[null,null,"MC","Monaco"]
[null,null,"MN","Mongolia"]
[null,null,"ME","Montenegro, Republic of"]
[null,null,"MS","Montserrat"]
[null,null,"MA","Morocco"]
[null,null,"MZ","Mozambique"]
[null,null,"MM","Myanmar"]
[null,null,"NA","Namibia"]
[null,null,"NR","Nauru"]
[null,null,"NP","Nepal"]
[null,null,"NL","Netherlands"]
[null,null,"AN","Netherlands Antilles"]
[null,null,"NC","New Caledonia"]
[null,null,"NZ","New Zealand"]
[null,null,"NI","Nicaragua"]
[null,null,"NE","Niger"]
[null,null,"NG","Nigeria"]
[null,null,"NU","Niue"]
[null,null,"NF","Norfolk Island"]
[null,null,"MP","Northern Mariana Islands"]
[null,null,"NO","Norway"]
[null,null,"OM","Oman"]
[null,null,"PK","Pakistan"]
[null,null,"PW","Palau"]
[null,null,"PA","Panama"]
[null,null,"PG","Papua New Guinea"]
[null,null,"PY","Paraguay"]
[null,null,"PE","Peru"]
[null,null,"PH","Philippines"]
[null,null,"PN","Pitcairn "]
[null,null,"PL","Poland"]
[null,null,"PT","Portugal"]
[null,null,"PR","Puerto Rico"]
[null,null,"QA","Qatar"]
[null,null,"RE","Réunion"]
[null,null,"RO","Romania"]
[null,null,"RU","Russian Federation"]
[null,null,"RW","Rwanda"]
[null,null,"BQ","Saba (BES islands)"]
[null,null,"WS","Samoa "]
[null,null,"SM","San Marino"]
[null,null,"ST","São Tomé and Príncipe"]
[null,null,"SA","Saudi Arabia"]
[null,null,"SN","Senegal"]
[null,null,"RS","Serbia, Republic of"]
[null,null,"SC","Seychelles"]
[null,null,"SL","Sierra Leone"]
[null,null,"SG","Singapore"]
[null,null,"SX","Sint Maarten"]
[null,null,"BQ","Sint-Eustatius (BES islands)"]
[null,null,"SK","Slovak Republic"]
[null,null,"SI","Slovenia"]
[null,null,"SB","Solomon Islands"]
[null,null,"SO","Somalia"]
{"$rows_left_out":56}